BDBM50087305 CHEMBL34434::[6-(8-Hydroxy-7,8-dihydro-6H-imidazo[4,5-d][1,3]diazepin-3-yl)-hexyl]-phosphonic acid 2H2O
SMILES OC1CNC=Nc2c1ncn2CCCCCCP(O)(O)=O
InChI Key InChIKey=JMXCBDOZJPVUPN-UHFFFAOYSA-N
Data  2 KI
  Tab Delimited (TSV)   2D SDfile   Computed 3D by Vconf -m prep SDfile
Find this compound or compounds like it in BindingDB:
Activity Spreadsheet -- Enzyme Inhibition Constant Data from BindingDB
Found 2 hits for monomerid = 50087305
TargetAdenosine deaminase(Bos taurus (bovine))
Metabasis Therapeutics
Curated by ChEMBL
LigandPNGBDBM50087305(CHEMBL34434 | [6-(8-Hydroxy-7,8-dihydro-6H-imidazo...)
Affinity DataKi: >7.50E+3nM. Assay description: Evaluated for the inhibition of calf intestinal Adenosine deaminase (ADA)
In DepthDetails ArticlePubMed
TargetAMP deaminase 2(Homo sapiens (Human))
Metabasis Therapeutics
Curated by ChEMBL
LigandPNGBDBM50087305(CHEMBL34434 | [6-(8-Hydroxy-7,8-dihydro-6H-imidazo...)
Affinity DataKi:  5.50E+4nM. Assay description: Evaluated for the inhibition of porcine heart or human L-type Adenosine 5'-monophosphate deaminase (AMPDA)
In DepthDetails ArticlePubMed