BDBM50087312 3-Hexyl-3,6,7,8-tetrahydro-imidazo[4,5-d][1,3]diazepin-8-ol::CHEMBL37246
SMILES CCCCCCn1cnc2C(O)CNC=Nc12
InChI Key InChIKey=STMONNTYIUSYFY-UHFFFAOYSA-N
Data  2 KI
  Tab Delimited (TSV)   2D SDfile   Computed 3D by Vconf -m prep SDfile
Find this compound or compounds like it in BindingDB:
Activity Spreadsheet -- Enzyme Inhibition Constant Data from BindingDB
Found 2 hits for monomerid = 50087312
TargetAdenosine deaminase(Bos taurus (bovine))
Metabasis Therapeutics
Curated by ChEMBL
LigandPNGBDBM50087312(3-Hexyl-3,6,7,8-tetrahydro-imidazo[4,5-d][1,3]diaz...)
Affinity DataKi:  480nM. Assay description: Evaluated for the inhibition of calf intestinal Adenosine deaminase (ADA)
In DepthDetails ArticlePubMed
TargetAMP deaminase 2(Homo sapiens (Human))
Metabasis Therapeutics
Curated by ChEMBL
LigandPNGBDBM50087312(3-Hexyl-3,6,7,8-tetrahydro-imidazo[4,5-d][1,3]diaz...)
Affinity DataKi:  2.00E+4nM. Assay description: Evaluated for the inhibition of porcine heart or human L-type Adenosine 5'-monophosphate deaminase (AMPDA)
In DepthDetails ArticlePubMed