BDBM50087322 3-[5-(1H-Tetrazol-5-yl)-pentyl]-3,6,7,8-tetrahydro-imidazo[4,5-d][1,3]diazepin-8-ol 2H2O::CHEMBL36046
SMILES OC1CNC=Nc2c1ncn2CCCCCc1nnn[nH]1
InChI Key InChIKey=GKPQNAANOGZWGV-UHFFFAOYSA-N
Data  2 KI
  Tab Delimited (TSV)   2D SDfile   Computed 3D by Vconf -m prep SDfile
Find this compound or compounds like it in BindingDB:
Activity Spreadsheet -- Enzyme Inhibition Constant Data from BindingDB
Found 2 hits for monomerid = 50087322
TargetAMP deaminase 2(Homo sapiens (Human))
Metabasis Therapeutics
Curated by ChEMBL
LigandPNGBDBM50087322(3-[5-(1H-Tetrazol-5-yl)-pentyl]-3,6,7,8-tetrahydro...)
Affinity DataKi:  6.00E+3nM. Assay description: Evaluated for the inhibition of porcine heart or human L-type Adenosine 5'-monophosphate deaminase (AMPDA)
In DepthDetails ArticlePubMed
TargetAdenosine deaminase(Bos taurus (bovine))
Metabasis Therapeutics
Curated by ChEMBL
LigandPNGBDBM50087322(3-[5-(1H-Tetrazol-5-yl)-pentyl]-3,6,7,8-tetrahydro...)
Affinity DataKi: >7.50E+3nM. Assay description: Evaluated for the inhibition of calf intestinal Adenosine deaminase (ADA)
In DepthDetails ArticlePubMed