BDBM50088198 CHEMBL59297::E-2-Amino-4-[3-(2,6-dichloro-phenyl)-allyl]-pentanedioic acid
SMILES N[C@@H](C[C@@H](C\C=C\c1c(Cl)cccc1Cl)C(O)=O)C(O)=O
InChI Key InChIKey=SUPABNAXCCLJMI-PRWSZKMTSA-N
Data  2 KI
  Tab Delimited (TSV)   2D SDfile   Computed 3D by Vconf -m prep SDfile
Find this compound or compounds like it in BindingDB:
Activity Spreadsheet -- Enzyme Inhibition Constant Data from BindingDB
Found 2 hits for monomerid = 50088198
TargetGlutamate receptor ionotropic, kainate 1(Homo sapiens (Human))
Eli Lilly
Curated by ChEMBL
LigandPNGBDBM50088198(CHEMBL59297 | E-2-Amino-4-[3-(2,6-dichloro-phenyl)...)
Affinity DataKi:  131nM. Assay description: Binding affinity against human ionotropic glutamate receptor kainate 1 in HK293 cells using [3H]-kainate as radioligand
In DepthDetails ArticlePubMed
TargetGlutamate receptor ionotropic, kainate 2(Homo sapiens (Human))
Eli Lilly
Curated by ChEMBL
LigandPNGBDBM50088198(CHEMBL59297 | E-2-Amino-4-[3-(2,6-dichloro-phenyl)...)
Affinity DataKi:  1.57E+3nM. Assay description: Binding affinity against human ionotropic glutamate receptor ionotropic kainate 2 in HEK293 cells using [3H]-kainate as radioligand
In DepthDetails ArticlePubMed