BDBM50088542 CHEMBL3576950
SMILES NC(=O)c1cccc(n1)-c1ccc2N(CCOCc2c1)c1ccc(cc1)C(F)(F)F
InChI Key InChIKey=HMXYTGIRFTYLJV-UHFFFAOYSA-N
Data  1 IC50
  Tab Delimited (TSV)   2D SDfile   Computed 3D by Vconf -m prep SDfile
Find this compound or compounds like it in BindingDB:
Activity Spreadsheet -- Enzyme Inhibition Constant Data from BindingDB
Found 1 hit for monomerid = 50088542
TargetSodium channel protein type 9 subunit alpha(Homo sapiens (Human))
Purdue Pharma
Curated by ChEMBL
LigandPNGBDBM50088542(CHEMBL3576950)
Affinity DataIC50:  400nM. Assay description: Inhibition of Nav1.7 (unknown origin) expressed in CHO cells after 45 mins by FLIPR assay
In DepthDetails ArticlePubMed