BDBM50088691 3-Amino-6-ethyl-2-[3-(4-pyrimidin-2-yl-piperazin-1-yl)-propylsulfanyl]-3H-thieno[2,3-d]pyrimidin-4-one::CHEMBL416707
SMILES CCc1cc2c(nc(SCCCN3CCN(CC3)c3ncccn3)n(N)c2=O)s1
InChI Key InChIKey=IFTKFQOWJSYLHC-UHFFFAOYSA-N
Data  2 KI
  Tab Delimited (TSV)   2D SDfile   Computed 3D by Vconf -m prep SDfile
Find this compound or compounds like it in BindingDB:
Activity Spreadsheet -- Enzyme Inhibition Constant Data from BindingDB
Found 2 hits for monomerid = 50088691
Target5-hydroxytryptamine receptor 1A(Rattus norvegicus (rat))
Università
Curated by ChEMBL
LigandPNGBDBM50088691(3-Amino-6-ethyl-2-[3-(4-pyrimidin-2-yl-piperazin-1...)
Affinity DataKi:  9.40nM. Assay description: Displacement of [3H]-8-OH-DPAT from 5-hydroxytryptamine 1A receptor of rat hippocampus membranes
In DepthDetails ArticlePubMed
TargetAlpha-1A/Alpha-1B/Alpha-1D adrenergic receptor(Rattus norvegicus (rat))
Università
Curated by ChEMBL
LigandPNGBDBM50088691(3-Amino-6-ethyl-2-[3-(4-pyrimidin-2-yl-piperazin-1...)
Affinity DataKi:  1.95E+3nM. Assay description: Displacement of [3H]prazosin from Alpha-1 adrenergic receptor of rat cortex membranes
In DepthDetails ArticlePubMed