BDBM50088719 4-[((1R,3R,5S)-8-Cyclohexylmethyl-8-aza-bicyclo[3.2.1]oct-3-yl)-phenyl-amino]-N,N-diethyl-benzamide::CHEMBL13301
SMILES CCN(CC)C(=O)c1ccc(cc1)N([C@@H]1C[C@@H]2CC[C@H](C1)N2CC1CCCCC1)c1ccccc1
InChI Key InChIKey=CLHUMNXNVGHXAV-BKHFGAQXSA-N
Data  2 KI
  Tab Delimited (TSV)   2D SDfile   Computed 3D by Vconf -m prep SDfile
Find this compound or compounds like it in BindingDB:
Activity Spreadsheet -- Enzyme Inhibition Constant Data from BindingDB
Found 2 hits for monomerid = 50088719
TargetDelta-type opioid receptor(Rattus norvegicus (rat))
R. W. Johnson Pharmaceutical Research Institute
Curated by ChEMBL
LigandPNGBDBM50088719(4-[((1R,3R,5S)-8-Cyclohexylmethyl-8-aza-bicyclo[3....)
Affinity DataKi:  77nM. Assay description: Inhibition of [3H]-DPDPE radioligand binding to rat opioid receptor delta 1 site from rat brain membranes
In DepthDetails ArticlePubMed
TargetMu-type opioid receptor(Rattus norvegicus (rat))
R. W. Johnson Pharmaceutical Research Institute
Curated by ChEMBL
LigandPNGBDBM50088719(4-[((1R,3R,5S)-8-Cyclohexylmethyl-8-aza-bicyclo[3....)
Affinity DataKi:  371nM. Assay description: Binding affinity of the compound was determined by inhibition of [3H]-DAMGO binding to Opioid receptor mu 1 from rat brain membranes
In DepthDetails ArticlePubMed