BDBM50089459 CHEMBL33168::N-{4-[2-((R)-2-Hydroxy-2-pyridin-3-yl-ethylamino)-ethyl]-phenyl}-4-(5-methyl-[1,2,4]oxadiazol-3-yl)-benzenesulfonamide
SMILES Cc1nc(no1)-c1ccc(cc1)S(=O)(=O)Nc1ccc(CCNC[C@H](O)c2cccnc2)cc1
InChI Key InChIKey=ZYGLGCDPFJSPKY-QHCPKHFHSA-N
Data  2 IC50  1 EC50
  Tab Delimited (TSV)   2D SDfile   Computed 3D by Vconf -m prep SDfile
Find this compound or compounds like it in BindingDB:
Activity Spreadsheet -- Enzyme Inhibition Constant Data from BindingDB
Found 3 hits for monomerid = 50089459
TargetBeta-2 adrenergic receptor(Homo sapiens (Human))
Merck Research Laboratories
Curated by ChEMBL
LigandPNGBDBM50089459(CHEMBL33168 | N-{4-[2-((R)-2-Hydroxy-2-pyridin-3-y...)
Affinity DataIC50:  1.00E+4nM. Assay description: Binding affinity towards Beta-2 adrenergic receptor prepared from CHO cells expressing the cloned human receptor in the presence of [125I]-iodocyanop...
In DepthDetails ArticlePubMed
TargetBeta-3 adrenergic receptor(Homo sapiens (Human))
Merck Research Laboratories
Curated by ChEMBL
LigandPNGBDBM50089459(CHEMBL33168 | N-{4-[2-((R)-2-Hydroxy-2-pyridin-3-y...)
Affinity DataEC50: >100nM. Assay description: Agonist activity as increasedn cAMP production in Chinese hamster ovary (CHO)cells expressing human beta-3 adrenergic receptor
In DepthDetails ArticlePubMed
TargetBeta-1 adrenergic receptor(Homo sapiens (Human))
Merck Research Laboratories
Curated by ChEMBL
LigandPNGBDBM50089459(CHEMBL33168 | N-{4-[2-((R)-2-Hydroxy-2-pyridin-3-y...)
Affinity DataIC50:  1.00E+4nM. Assay description: Binding affinity towards cloned human Beta-1 adrenergic receptor prepared from CHO cells in the presence of [125I]-iodocyanopindolol
In DepthDetails ArticlePubMed