BDBM50089710 4-(6-Chloro-benzo[1,3]dioxol-5-ylmethyl)-2-(3-methoxy-benzyl)-5-trifluoromethyl-2H-pyrazol-3-ol::CHEMBL3144605
SMILES COc1cccc(Cn2[nH]c(c(Cc3cc4OCOc4cc3Cl)c2=O)C(F)(F)F)c1
InChI Key InChIKey=QSTTWKUTTDQNQP-UHFFFAOYSA-N
Data  2 IC50
  Tab Delimited (TSV)   2D SDfile   Computed 3D by Vconf -m prep SDfile
Find this compound or compounds like it in BindingDB:
Activity Spreadsheet -- Enzyme Inhibition Constant Data from BindingDB
Found 2 hits for monomerid = 50089710
TargetEndothelin receptor type B(RAT)
Hoechst Marion Roussel
Curated by ChEMBL
LigandPNGBDBM50089710(4-(6-Chloro-benzo[1,3]dioxol-5-ylmethyl)-2-(3-meth...)
Affinity DataIC50:  2.40E+3nM. Assay description: In vitro inhibition of [125-I] labelled ET-1 endothelin binding to Endothelin B receptor in rat cerebellum
In DepthDetails ArticlePubMed
TargetEndothelin-1 receptor(RAT)
Hoechst Marion Roussel
Curated by ChEMBL
LigandPNGBDBM50089710(4-(6-Chloro-benzo[1,3]dioxol-5-ylmethyl)-2-(3-meth...)
Affinity DataIC50:  600nM. Assay description: In vitro inhibition of endothelin binding to endothelin A receptor in rat heart ventricles was measured using a 125-I labelled ET-1 competition assay
In DepthDetails ArticlePubMed