BDBM50089726 4-Benzo[1,3]dioxol-5-ylmethyl-2-(3-hydroxy-benzyl)-5-trifluoromethyl-2H-pyrazol-3-ol::CHEMBL3144606
SMILES Oc1cccc(Cn2[nH]c(c(Cc3ccc4OCOc4c3)c2=O)C(F)(F)F)c1
InChI Key InChIKey=OTKMDVKDOJNFLC-UHFFFAOYSA-N
Data  2 IC50
  Tab Delimited (TSV)   2D SDfile   Computed 3D by Vconf -m prep SDfile
Find this compound or compounds like it in BindingDB:
Activity Spreadsheet -- Enzyme Inhibition Constant Data from BindingDB
Found 2 hits for monomerid = 50089726
TargetEndothelin receptor type B(RAT)
Hoechst Marion Roussel
Curated by ChEMBL
LigandPNGBDBM50089726(4-Benzo[1,3]dioxol-5-ylmethyl-2-(3-hydroxy-benzyl)...)
Affinity DataIC50:  3.60E+4nM. Assay description: In vitro inhibition of [125-I] labelled ET-1 endothelin binding to Endothelin B receptor in rat cerebellum
In DepthDetails ArticlePubMed
TargetEndothelin-1 receptor(RAT)
Hoechst Marion Roussel
Curated by ChEMBL
LigandPNGBDBM50089726(4-Benzo[1,3]dioxol-5-ylmethyl-2-(3-hydroxy-benzyl)...)
Affinity DataIC50:  1.70E+3nM. Assay description: In vitro inhibition of endothelin binding to endothelin A receptor in rat heart ventricles was measured using a 125-I labelled ET-1 competition assay
In DepthDetails ArticlePubMed