BDBM50089735 2-(3-Methoxy-benzyl)-4-(4-methoxy-benzyl)-5-trifluoromethyl-2H-pyrazol-3-ol::CHEMBL3144736
SMILES COc1ccc(Cc2c([nH]n(Cc3cccc(OC)c3)c2=O)C(F)(F)F)cc1
InChI Key InChIKey=GWQNEJDAFZWWCQ-UHFFFAOYSA-N
Data  2 IC50
  Tab Delimited (TSV)   2D SDfile   Computed 3D by Vconf -m prep SDfile
Find this compound or compounds like it in BindingDB:
Activity Spreadsheet -- Enzyme Inhibition Constant Data from BindingDB
Found 2 hits for monomerid = 50089735
TargetEndothelin receptor type B(RAT)
Hoechst Marion Roussel
Curated by ChEMBL
LigandPNGBDBM50089735(2-(3-Methoxy-benzyl)-4-(4-methoxy-benzyl)-5-triflu...)
Affinity DataIC50:  3.90E+4nM. Assay description: In vitro inhibition of [125-I] labelled ET-1 endothelin binding to Endothelin B receptor in rat cerebellum
In DepthDetails ArticlePubMed
TargetEndothelin-1 receptor(RAT)
Hoechst Marion Roussel
Curated by ChEMBL
LigandPNGBDBM50089735(2-(3-Methoxy-benzyl)-4-(4-methoxy-benzyl)-5-triflu...)
Affinity DataIC50:  4.80E+4nM. Assay description: In vitro inhibition of endothelin binding to endothelin A receptor in rat heart ventricles was measured using a 125-I labelled ET-1 competition assay
In DepthDetails ArticlePubMed