BDBM50090333 (R)-4-(3,4-Difluoro-phenyl)-1,2-dimethyl-6-oxo-1,4,5,6-tetrahydro-pyridine-3-carboxylic acid {3-[4-cyano-4-(2-cyano-4-fluoro-phenyl)-piperidin-1-yl]-propyl}-amide::CHEMBL43594
SMILES CN1C(=O)C[C@@H](C(C(=O)NCCCN2CCC(CC2)(C#N)c2ccc(F)cc2C#N)=C1C)c1ccc(F)c(F)c1
InChI Key InChIKey=LEVRYVCMBBJQLU-HSZRJFAPSA-N
Data  7 KI
  Tab Delimited (TSV)   2D SDfile   Computed 3D by Vconf -m prep SDfile
Find this compound or compounds like it in BindingDB:
Activity Spreadsheet -- Enzyme Inhibition Constant Data from BindingDB
Found 7 hits for monomerid = 50090333
TargetAlpha-1A adrenergic receptor(Homo sapiens (Human))
Merck
Curated by ChEMBL
LigandPNGBDBM50090333((R)-4-(3,4-Difluoro-phenyl)-1,2-dimethyl-6-oxo-1,4...)
Affinity DataKi:  7nM. Assay description: In vitro antagonism at Alpha-1A adrenergic receptor
In DepthDetails ArticlePubMed
TargetHistamine H1 receptor(Homo sapiens (Human))
Merck
Curated by ChEMBL
LigandPNGBDBM50090333((R)-4-(3,4-Difluoro-phenyl)-1,2-dimethyl-6-oxo-1,4...)
Affinity DataKi:  616nM. Assay description: Selectivity screen against human Histamine H1 receptor
In DepthDetails ArticlePubMed
TargetAlpha-2B adrenergic receptor(Homo sapiens (Human))
Merck
Curated by ChEMBL
LigandPNGBDBM50090333((R)-4-(3,4-Difluoro-phenyl)-1,2-dimethyl-6-oxo-1,4...)
Affinity DataKi:  1.76E+3nM. Assay description: In vivo inhibitory effect of the compound against alpha-2b Adrenergic receptor
In DepthDetails ArticlePubMed
TargetAlpha-1B adrenergic receptor(Homo sapiens (Human))
Merck
Curated by ChEMBL
LigandPNGBDBM50090333((R)-4-(3,4-Difluoro-phenyl)-1,2-dimethyl-6-oxo-1,4...)
Affinity DataKi: >2.00E+3nM. Assay description: In vitro antagonism at Alpha-1B adrenergic receptor
In DepthDetails ArticlePubMed
TargetAlpha-1D adrenergic receptor(Homo sapiens (Human))
Merck
Curated by ChEMBL
LigandPNGBDBM50090333((R)-4-(3,4-Difluoro-phenyl)-1,2-dimethyl-6-oxo-1,4...)
Affinity DataKi: >5.00E+3nM. Assay description: In vitro antagonism at Alpha-1D adrenergic receptor
In DepthDetails ArticlePubMed
TargetAlpha-2C adrenergic receptor(Homo sapiens (Human))
Merck
Curated by ChEMBL
LigandPNGBDBM50090333((R)-4-(3,4-Difluoro-phenyl)-1,2-dimethyl-6-oxo-1,4...)
Affinity DataKi:  6.53E+3nM. Assay description: In vivo inhibitory effect of the compound against Alpha-2C adrenergic receptor
In DepthDetails ArticlePubMed
TargetAlpha-2A adrenergic receptor(Homo sapiens (Human))
Merck
Curated by ChEMBL
LigandPNGBDBM50090333((R)-4-(3,4-Difluoro-phenyl)-1,2-dimethyl-6-oxo-1,4...)
Affinity DataKi:  1.36E+4nM. Assay description: In vivo inhibitory effect against Alpha-2A adrenergic receptor
In DepthDetails ArticlePubMed