BDBM50091343 CHEMBL3582259
SMILES C[C@H](Cc1ccccc1-c1ccccc1)C1=NCCN1
InChI Key InChIKey=VKOXICYFEFRTQW-CQSZACIVSA-N
Data  1 KI
  Tab Delimited (TSV)   2D SDfile   Computed 3D by Vconf -m prep SDfile
Find this compound or compounds like it in BindingDB:
Activity Spreadsheet -- Enzyme Inhibition Constant Data from BindingDB
Found 1 hit for monomerid = 50091343
TargetNischarin(RAT)
University Of Camerino
Curated by ChEMBL
LigandPNGBDBM50091343(CHEMBL3582259)
Affinity DataKi:  2.24E+3nM. Assay description: Displacement of [125I]-p-iodoclonidin from I1-imidazoline receptor in rat PC12 cell membranes
In DepthDetails ArticlePubMed