BDBM50091584 3-[2-(2-Benzyloxycarbonylamino-3-methyl-butyrylamino)-propionylamino]-4-[5-(2,6-dichloro-phenyl)-oxazol-2-yl]-4-oxo-butyric acid::CHEMBL112370
SMILES CC(C)[C@H](NC(=O)OCc1ccccc1)C(=O)N[C@@H](C)C(=O)N[C@@H](CC(O)=O)C(=O)c1ncc(o1)-c1c(Cl)cccc1Cl
InChI Key InChIKey=PWESWMLIWGKYQQ-YFBXQHAESA-N
Data  1 KI
  Tab Delimited (TSV)   2D SDfile   Computed 3D by Vconf -m prep SDfile
Find this compound or compounds like it in BindingDB:
Activity Spreadsheet -- Enzyme Inhibition Constant Data from BindingDB
Found 1 hit for monomerid = 50091584
TargetCaspase-1(Homo sapiens (Human))
Basf Bioresearch
Curated by ChEMBL
LigandPNGBDBM50091584(3-[2-(2-Benzyloxycarbonylamino-3-methyl-butyrylami...)
Affinity DataKi:  160nM. Assay description: Compound was evaluated for the inhibitory activity against caspase-1
In DepthDetails ArticlePubMed