BDBM50092032 4-[4-(3,4-Difluoro-benzyl)-[1,2,3]triazol-2-yl]-N-{4-[2-((R)-2-hydroxy-2-pyridin-3-yl-ethylamino)-ethyl]-phenyl}-benzenesulfonamide::CHEMBL65513
SMILES O[C@@H](CNCCc1ccc(NS(=O)(=O)c2ccc(cc2)-n2ncc(Cc3ccc(F)c(F)c3)n2)cc1)c1cccnc1
InChI Key InChIKey=BQMLMSARZMEBIQ-PMERELPUSA-N
Data  2 IC50  1 EC50
  Tab Delimited (TSV)   2D SDfile   Computed 3D by Vconf -m prep SDfile
Find this compound or compounds like it in BindingDB:
Activity Spreadsheet -- Enzyme Inhibition Constant Data from BindingDB
Found 3 hits for monomerid = 50092032
TargetBeta-2 adrenergic receptor(Homo sapiens (Human))
Merck Research Laboratories
Curated by ChEMBL
LigandPNGBDBM50092032(4-[4-(3,4-Difluoro-benzyl)-[1,2,3]triazol-2-yl]-N-...)
Affinity DataIC50:  1.00E+3nM. Assay description: Binding affinity for clone human Beta-2 adrenergic receptor from CHO cell membranes in the presence of I-iodocyanopindolol
In DepthDetails ArticlePubMed
TargetBeta-3 adrenergic receptor(Homo sapiens (Human))
Merck Research Laboratories
Curated by ChEMBL
LigandPNGBDBM50092032(4-[4-(3,4-Difluoro-benzyl)-[1,2,3]triazol-2-yl]-N-...)
Affinity DataEC50:  7.20nM. Assay description: Tested in vitro for its ability to stimulate increase in cAMP in CHO cellsexpressing the cloned human beta-3 adrenergic receptor
In DepthDetails ArticlePubMed
TargetBeta-1 adrenergic receptor(Homo sapiens (Human))
Merck Research Laboratories
Curated by ChEMBL
LigandPNGBDBM50092032(4-[4-(3,4-Difluoro-benzyl)-[1,2,3]triazol-2-yl]-N-...)
Affinity DataIC50:  2.00E+3nM. Assay description: Binding affinity for cloned human Beta-1 adrenergic receptor expressed in CHO cells, tested in the presence of I-iodocyanopindolol.
In DepthDetails ArticlePubMed