BDBM50092981 CHEMBL3586480
SMILES OC(=O)CSC(=O)[C@H](Cc1ccccc1)NC(=O)Cc1cccs1
InChI Key InChIKey=JVFBAODSGLGAMN-AWEZNQCLSA-N
Data  1 KI  1 IC50
  Tab Delimited (TSV)   2D SDfile   Computed 3D by Vconf -m prep SDfile
Find this compound or compounds like it in BindingDB:
Activity Spreadsheet -- Enzyme Inhibition Constant Data from BindingDB
Found 1 hit for monomerid = 50092981
TargetMetallo-beta-lactamase L1 type 3(Stenotrophomonas maltophilia)
North-West University
Curated by ChEMBL
LigandPNGBDBM50092981(CHEMBL3586480)
Affinity DataKi:  950nM. Assay description: Mixed-type inhibition of Stenotrophomonas maltophilia L1 overexpressed in Escherichia coli BL21 (DE3) using imipenem as substrate incubated for 30 mi...
In DepthDetails ArticlePubMed