BDBM50093137 CHEMBL80149::[(S)-1-(4-Aminomethyl-benzylcarbamoyl)-ethyl]-carbamic acid 4-[(S)-1-(4-aminomethyl-benzylcarbamoyl)-ethylcarbamoyloxymethyl]-benzyl ester
SMILES C[C@H](NC(=O)OCc1ccc(COC(=O)N[C@@H](C)C(=O)NCc2ccc(CN)cc2)cc1)C(=O)NCc1ccc(CN)cc1
InChI Key InChIKey=UFOLUMXDIVXLEH-VXKWHMMOSA-N
Data  4 KI
  Tab Delimited (TSV)   2D SDfile   Computed 3D by Vconf -m prep SDfile
Find this compound or compounds like it in BindingDB:
Activity Spreadsheet -- Enzyme Inhibition Constant Data from BindingDB
Found 4 hits for monomerid = 50093137
TargetTryptase beta-2(Homo sapiens (Human))
Axys Pharmaceuticals
Curated by ChEMBL
LigandPNGBDBM50093137(CHEMBL80149 | [(S)-1-(4-Aminomethyl-benzylcarbamoy...)
Affinity DataKi:  366nM. Assay description: Inhibitory potency against tryptase
In DepthDetails ArticlePubMed
TargetPlasminogen(Homo sapiens (Human))
Axys Pharmaceuticals
Curated by ChEMBL
LigandPNGBDBM50093137(CHEMBL80149 | [(S)-1-(4-Aminomethyl-benzylcarbamoy...)
Affinity DataKi:  8.30E+4nM. Assay description: Inhibitory potency against plasmin
In DepthDetails ArticlePubMed
TargetSerine protease 1(Homo sapiens (Human))
Axys Pharmaceuticals
Curated by ChEMBL
LigandPNGBDBM50093137(CHEMBL80149 | [(S)-1-(4-Aminomethyl-benzylcarbamoy...)
Affinity DataKi:  2.73E+5nM. Assay description: Inhibitory potency against trypsin
In DepthDetails ArticlePubMed
TargetProthrombin(Homo sapiens (Human))
Axys Pharmaceuticals
Curated by ChEMBL
LigandPNGBDBM50093137(CHEMBL80149 | [(S)-1-(4-Aminomethyl-benzylcarbamoy...)
Affinity DataKi: >1.00E+6nM. Assay description: Inhibitory potency against thrombin
In DepthDetails ArticlePubMed