BDBM50093147 CHEMBL79545::Pentanedioic acid 4-guanidino-benzylamide 4-{[4-(4-guanidino-benzylcarbamoyl)-butyrylamino]-methyl}-benzylamide
SMILES [#7]\[#6](-[#7])=[#7]/c1ccc(-[#6]-[#7]-[#6](=O)-[#6]-[#6]-[#6]-[#6](=O)-[#7]-[#6]-c2ccc(-[#6]-[#7]-[#6](=O)-[#6]-[#6]-[#6]-[#6](=O)-[#7]-[#6]-c3ccc(cc3)\[#7]=[#6](/[#7])-[#7])cc2)cc1
InChI Key InChIKey=MQFPKMGNYBQKII-UHFFFAOYSA-N
Data  4 KI
  Tab Delimited (TSV)   2D SDfile   Computed 3D by Vconf -m prep SDfile
Find this compound or compounds like it in BindingDB:
Activity Spreadsheet -- Enzyme Inhibition Constant Data from BindingDB
Found 4 hits for monomerid = 50093147
TargetTryptase beta-2(Homo sapiens (Human))
Axys Pharmaceuticals
Curated by ChEMBL
LigandPNGBDBM50093147(CHEMBL79545 | Pentanedioic acid 4-guanidino-benzyl...)
Affinity DataKi:  100nM. Assay description: Inhibitory potency against tryptase
In DepthDetails ArticlePubMed
TargetSerine protease 1(Homo sapiens (Human))
Axys Pharmaceuticals
Curated by ChEMBL
LigandPNGBDBM50093147(CHEMBL79545 | Pentanedioic acid 4-guanidino-benzyl...)
Affinity DataKi:  7.00E+4nM. Assay description: Inhibitory potency against trypsin
In DepthDetails ArticlePubMed
TargetProthrombin(Homo sapiens (Human))
Axys Pharmaceuticals
Curated by ChEMBL
LigandPNGBDBM50093147(CHEMBL79545 | Pentanedioic acid 4-guanidino-benzyl...)
Affinity DataKi:  4.92E+5nM. Assay description: Inhibitory potency against thrombin
In DepthDetails ArticlePubMed
TargetPlasminogen(Homo sapiens (Human))
Axys Pharmaceuticals
Curated by ChEMBL
LigandPNGBDBM50093147(CHEMBL79545 | Pentanedioic acid 4-guanidino-benzyl...)
Affinity DataKi: >1.00E+6nM. Assay description: Inhibitory potency against plasmin
In DepthDetails ArticlePubMed