BDBM50093154 CHEMBL448786::Derivative of piperazine-1-carboxylic acid 5-(piperazine-1-carbonyloxy)-cyclooctyl ester
SMILES NC(=N)c1ccc(CCC(=O)N2CCN(CC2)C(=O)O[C@H]2CCC[C@H](CCC2)OC(=O)N2CCN(CC2)C(=O)CCc2ccc(cc2)C(N)=N)cc1
InChI Key InChIKey=SZSTYZLOARLHRK-MEKGRNQZSA-N
Data  4 KI
  Tab Delimited (TSV)   2D SDfile   Computed 3D by Vconf -m prep SDfile
Find this compound or compounds like it in BindingDB:
Activity Spreadsheet -- Enzyme Inhibition Constant Data from BindingDB
Found 4 hits for monomerid = 50093154
TargetTryptase beta-2/delta/gamma(Homo sapiens (Human))
Axys Pharmaceuticals
Curated by ChEMBL
LigandPNGBDBM50093154(CHEMBL448786 | Derivative of piperazine-1-carboxyl...)
Affinity DataKi:  0.400nM. Assay description: Evaluated for its inhibitory potency against tryptase
In DepthDetails ArticlePubMed
TargetSerine protease 1(Homo sapiens (Human))
Axys Pharmaceuticals
Curated by ChEMBL
LigandPNGBDBM50093154(CHEMBL448786 | Derivative of piperazine-1-carboxyl...)
Affinity DataKi:  2.10E+4nM. Assay description: Compound was evaluated for its inhibitory potency against trypsin
In DepthDetails ArticlePubMed
TargetProthrombin(Homo sapiens (Human))
Axys Pharmaceuticals
Curated by ChEMBL
LigandPNGBDBM50093154(CHEMBL448786 | Derivative of piperazine-1-carboxyl...)
Affinity DataKi:  2.90E+4nM. Assay description: Compound was evaluated for its inhibitory potency against thrombin
In DepthDetails ArticlePubMed
TargetPlasminogen(Homo sapiens (Human))
Axys Pharmaceuticals
Curated by ChEMBL
LigandPNGBDBM50093154(CHEMBL448786 | Derivative of piperazine-1-carboxyl...)
Affinity DataKi:  6.60E+4nM. Assay description: Compound was evaluated for its inhibitory potency against plasmin
In DepthDetails ArticlePubMed