BDBM50093156 CHEMBL432172::Derivative of APC-2059
SMILES [#7]\[#6](-[#7])=[#7]/c1ccc(-[#6]-[#7]-[#6](=O)-[#7]-2-[#6]-[#6]-[#7](-[#6]-[#6]-2)-[#6](=O)-[#8]-[#6]C23[#6]-[#6]C([#6]-[#8]-[#6](=O)-[#7]-4-[#6]-[#6]-[#7](-[#6]-[#6]-4)-[#6](=O)-[#7]-[#6]-c4ccc(cc4)\[#7]=[#6](/[#7])-[#7])([#6]-[#6]2)[#6]-[#6]3)cc1
InChI Key InChIKey=XLCNADMNCIGXSS-UHFFFAOYSA-N
Data  4 KI
  Tab Delimited (TSV)   2D SDfile   Computed 3D by Vconf -m prep SDfile
Find this compound or compounds like it in BindingDB:
Activity Spreadsheet -- Enzyme Inhibition Constant Data from BindingDB
Found 4 hits for monomerid = 50093156
TargetTryptase beta-2/delta/gamma(Homo sapiens (Human))
Axys Pharmaceuticals
Curated by ChEMBL
LigandPNGBDBM50093156(CHEMBL432172 | Derivative of APC-2059)
Affinity DataKi:  0.400nM. Assay description: Evaluated for its inhibitory potency against tryptase
In DepthDetails ArticlePubMed
TargetPlasminogen(Homo sapiens (Human))
Axys Pharmaceuticals
Curated by ChEMBL
LigandPNGBDBM50093156(CHEMBL432172 | Derivative of APC-2059)
Affinity DataKi:  3.00E+3nM. Assay description: Compound was evaluated for its inhibitory potency against plasmin
In DepthDetails ArticlePubMed
TargetSerine protease 1(Homo sapiens (Human))
Axys Pharmaceuticals
Curated by ChEMBL
LigandPNGBDBM50093156(CHEMBL432172 | Derivative of APC-2059)
Affinity DataKi:  2.00E+4nM. Assay description: Compound was evaluated for its inhibitory potency against trypsin
In DepthDetails ArticlePubMed
TargetProthrombin(Homo sapiens (Human))
Axys Pharmaceuticals
Curated by ChEMBL
LigandPNGBDBM50093156(CHEMBL432172 | Derivative of APC-2059)
Affinity DataKi:  1.23E+5nM. Assay description: Compound was evaluated for its inhibitory potency against thrombin
In DepthDetails ArticlePubMed