BDBM50093475 CHEMBL1204498
SMILES OC(=O)c1cc(Oc2ncccn2)ccc1NC(=O)c1ccc(Cl)cc1Cl
InChI Key InChIKey=GOVRORCMTKLBKN-BFTGEINMSA-N
Data  1 EC50
PDB links: 3 PDB IDs match this monomer.
  Tab Delimited (TSV)   2D SDfile   Computed 3D by Vconf -m prep SDfile
Find this compound or compounds like it in BindingDB:
Activity Spreadsheet -- Enzyme Inhibition Constant Data from BindingDB
Found 1 hit for monomerid = 50093475
TargetPeroxisome proliferator-activated receptor gamma(Homo sapiens (Human))
Universitat Rovira I Virgili (Urv)
Curated by ChEMBL
LigandPNGBDBM50093475(CHEMBL1204498)
Affinity DataEC50:  1.30E+3nM. Assay description: Activity at human PPARgamma transfected in HEK293 cells assessed as transactivation activity by luciferase reporter gene assay