BDBM50094944 CHEMBL3589373
SMILES S=C1N2CCCC2c2c(nc(CN3CCOCC3)nc2N1c1ccccc1)N1CCOCC1
InChI Key InChIKey=ACUIUVJHJBPANP-UHFFFAOYSA-N
Data  5 IC50
  Tab Delimited (TSV)   2D SDfile   Computed 3D by Vconf -m prep SDfile
Find this compound or compounds like it in BindingDB:
Activity Spreadsheet -- Enzyme Inhibition Constant Data from BindingDB
Found 5 hits for monomerid = 50094944
LigandPNGBDBM50094944(CHEMBL3589373)
Affinity DataIC50:  1.20E+5nM. Assay description: Inhibition of GST-tagged p110delta (unknown origin) expressed in Sf9/Baculovirus system using [gamma-33P]ATP by scintillation proximity assay
In DepthDetails ArticlePubMed
TargetPhosphatidylinositol 4-phosphate 3-kinase C2 domain-containing subunit beta(Homo sapiens (Human))
Cairo University
Curated by ChEMBL
LigandPNGBDBM50094944(CHEMBL3589373)
Affinity DataIC50:  7.88E+4nM. Assay description: Inhibition of Glu-tagged PI3KC2beta (unknown origin) expressed in Sf9/Baculovirus system using [gamma-33P]ATP by scintillation proximity assay
In DepthDetails ArticlePubMed
LigandPNGBDBM50094944(CHEMBL3589373)
Affinity DataIC50:  7.82E+5nM. Assay description: Inhibition of His-tagged p110gamma (unknown origin) expressed in Sf9/Baculovirus system using [gamma-33P]ATP by scintillation proximity assay
In DepthDetails ArticlePubMed
LigandPNGBDBM50094944(CHEMBL3589373)
Affinity DataIC50:  3.23E+5nM. Assay description: Inhibition of GST-tagged human p110beta expressed in Sf9/Baculovirus system using [gamma-33P]ATP by scintillation proximity assay
In DepthDetails ArticlePubMed
LigandPNGBDBM50094944(CHEMBL3589373)
Affinity DataIC50:  2.34E+3nM. Assay description: Inhibition of GST-tagged bovine p110alpha expressed in Sf9/Baculovirus system using [gamma-33P]ATP by scintillation proximity assay
In DepthDetails ArticlePubMed