BDBM50096204 CHEMBL3593813
SMILES NC(=O)c1cccc2[nH]c(nc12)-c1ccc(cc1)-c1cncc(c1)C(=O)N1CCCC1
InChI Key InChIKey=YHUAYRYAJHEOFC-KINPZJHMSA-N
Data  2 IC50
  Tab Delimited (TSV)   2D SDfile   Computed 3D by Vconf -m prep SDfile
Find this compound or compounds like it in BindingDB:
Activity Spreadsheet -- Enzyme Inhibition Constant Data from BindingDB
Found 2 hits for monomerid = 50096204
TargetPoly [ADP-ribose] polymerase 1(Homo sapiens (Human))
University Of Malaya
Curated by ChEMBL
LigandPNGBDBM50096204(CHEMBL3593813)
Affinity DataIC50:  29nM. Assay description: Inhibition of PARP-1 (unknown origin) assessed as incorporation of biotinylated poly (ADP-ribose) onto histone protein after 60 mins by TACS-Sapphire...
In DepthDetails ArticlePubMed
TargetDihydroorotate dehydrogenase (quinone), mitochondrial(Homo sapiens (Human))
University Of Malaya
Curated by ChEMBL
LigandPNGBDBM50096204(CHEMBL3593813)
Affinity DataIC50:  2.80E+4nM. Assay description: Inhibition of DHODH (unknown origin) using L-DHO, DUQ, DCIP as substrate preincubated for 30 mins followed by substrate addition measured after 20 mi...
In DepthDetails ArticlePubMed