BDBM50096208 CHEMBL3593982
SMILES NC(=O)c1cccc2[nH]c(nc12)-c1ccc(cc1)-c1ccc(nc1)C(=O)N1CCCC1
InChI Key InChIKey=FVYLZIIFIANMNG-YECYZZSWSA-N
Data  1 IC50
  Tab Delimited (TSV)   2D SDfile   Computed 3D by Vconf -m prep SDfile
Find this compound or compounds like it in BindingDB:
Activity Spreadsheet -- Enzyme Inhibition Constant Data from BindingDB
Found 1 hit for monomerid = 50096208
TargetPoly [ADP-ribose] polymerase 1(Homo sapiens (Human))
University Of Malaya
Curated by ChEMBL
LigandPNGBDBM50096208(CHEMBL3593982)
Affinity DataIC50:  12nM. Assay description: Inhibition of PARP-1 (unknown origin) assessed as incorporation of biotinylated poly (ADP-ribose) onto histone protein after 60 mins by TACS-Sapphire...
In DepthDetails ArticlePubMed