BDBM50097024 4-(4-{2-[2-(3,5-Dimethyl-phenyl)-5-methoxy-1H-indol-3-yl]-ethylamino}-butyl)-phenol::CHEMBL346903
SMILES COc1ccc2[nH]c(c(CCNCCCCc3ccc(O)cc3)c2c1)-c1cc(C)cc(C)c1
InChI Key InChIKey=JRPZOLMQOSOAAE-UHFFFAOYSA-N
Data  1 IC50
  Tab Delimited (TSV)   2D SDfile   Computed 3D by Vconf -m prep SDfile
Find this compound or compounds like it in BindingDB:
Activity Spreadsheet -- Enzyme Inhibition Constant Data from BindingDB
Found 1 hit for monomerid = 50097024
TargetGonadotropin-releasing hormone receptor(Rattus norvegicus)
Merck Research Laboratories
Curated by ChEMBL
LigandPNGBDBM50097024(4-(4-{2-[2-(3,5-Dimethyl-phenyl)-5-methoxy-1H-indo...)
Affinity DataIC50:  40nM. Assay description: Binding affinity to rat Gonadotropin-releasing hormone receptor.
In DepthDetails ArticlePubMed