BDBM50097090 2-(4-Bromo-phenyl)-6-chloro-quinoline-4-carboxylic acid::CHEMBL153238
SMILES OC(=O)c1cc(nc2ccc(Cl)cc12)-c1ccc(Br)cc1
InChI Key InChIKey=LCUJVPKQAPUUAQ-UHFFFAOYSA-N
Data  2 IC50
  Tab Delimited (TSV)   2D SDfile   Computed 3D by Vconf -m prep SDfile
Find this compound or compounds like it in BindingDB:
Activity Spreadsheet -- Enzyme Inhibition Constant Data from BindingDB
Found 2 hits for monomerid = 50097090
TargetBifunctional glutamate/proline--tRNA ligase(Homo sapiens (Human))
Cubist Pharmaceuticals
Curated by ChEMBL
LigandPNGBDBM50097090(2-(4-Bromo-phenyl)-6-chloro-quinoline-4-carboxylic...)
Affinity DataIC50: >2.00E+4nM. Assay description: Aminoacylation activity against human prolyl-tRNA synthetase
In DepthDetails ArticlePubMed
TargetProline--tRNA ligase, cytoplasmic(Candida albicans)
Cubist Pharmaceuticals
Curated by ChEMBL
LigandPNGBDBM50097090(2-(4-Bromo-phenyl)-6-chloro-quinoline-4-carboxylic...)
Affinity DataIC50:  26nM. Assay description: Aminoacylation activity against Candida albicans prolyl-tRNA synthetase
In DepthDetails ArticlePubMed