BDBM50097102 2-(4-Bromo-phenyl)-6-chloro-8-methyl-quinoline-4-carboxylic acid furan-2-ylmethyl ester::CHEMBL150266
SMILES Cc1cc(Cl)cc2c(cc(nc12)-c1ccc(Br)cc1)C(=O)OCc1ccco1
InChI Key InChIKey=FFOCYOZUAILUNQ-UHFFFAOYSA-N
Data  2 IC50
  Tab Delimited (TSV)   2D SDfile   Computed 3D by Vconf -m prep SDfile
Find this compound or compounds like it in BindingDB:
Activity Spreadsheet -- Enzyme Inhibition Constant Data from BindingDB
Found 2 hits for monomerid = 50097102
TargetBifunctional glutamate/proline--tRNA ligase(Homo sapiens (Human))
Cubist Pharmaceuticals
Curated by ChEMBL
LigandPNGBDBM50097102(2-(4-Bromo-phenyl)-6-chloro-8-methyl-quinoline-4-c...)
Affinity DataIC50: >1.00E+5nM. Assay description: Aminoacylation activity against human prolyl-tRNA synthetase
In DepthDetails ArticlePubMed
TargetProline--tRNA ligase, cytoplasmic(Candida albicans)
Cubist Pharmaceuticals
Curated by ChEMBL
LigandPNGBDBM50097102(2-(4-Bromo-phenyl)-6-chloro-8-methyl-quinoline-4-c...)
Affinity DataIC50:  70nM. Assay description: Aminoacylation activity against Candida albicans prolyl-tRNA synthetase
In DepthDetails ArticlePubMed