BDBM50098889 4-[2-(5-Amino-6-oxo-2-m-tolyl-6H-pyrimidin-1-yl)-acetylamino]-2,2-difluoro-3-oxo-5-phenyl-pentanoic acid pentylamide::CHEMBL24697
SMILES CCCCCNC(=O)C(F)(F)C(=O)C(Cc1ccccc1)NC(=O)Cn1c(ncc(N)c1=O)-c1cccc(C)c1
InChI Key InChIKey=HCFCPJNPHOFKAO-UHFFFAOYSA-N
Data  2 KI
  Tab Delimited (TSV)   2D SDfile   Computed 3D by Vconf -m prep SDfile
Find this compound or compounds like it in BindingDB:
Activity Spreadsheet -- Enzyme Inhibition Constant Data from BindingDB
Found 2 hits for monomerid = 50098889
TargetChymase(Homo sapiens (Human))
Welfide
Curated by ChEMBL
LigandPNGBDBM50098889(4-[2-(5-Amino-6-oxo-2-m-tolyl-6H-pyrimidin-1-yl)-a...)
Affinity DataKi:  18.5nM. Assay description: In vitro inhibitory activity was determined against human heart chymase
In DepthDetails ArticlePubMed
TargetChymotrypsin-C(Homo sapiens (Human))
Welfide
Curated by ChEMBL
LigandPNGBDBM50098889(4-[2-(5-Amino-6-oxo-2-m-tolyl-6H-pyrimidin-1-yl)-a...)
Affinity DataKi:  451nM. Assay description: In vitro inhibitory activity was determined against bovine pancreas chymotrypsin
In DepthDetails ArticlePubMed