BDBM50098950 5-Furan-2-yl-4,5-dihydro-thieno[2,3-c]pyridin-7-ylamine::CHEMBL274405
SMILES NC1=NC(Cc2ccsc12)c1ccco1
InChI Key InChIKey=WAOKDGZAIYAHLD-UHFFFAOYSA-N
Data  3 IC50
  Tab Delimited (TSV)   2D SDfile   Computed 3D by Vconf -m prep SDfile
Find this compound or compounds like it in BindingDB:
Activity Spreadsheet -- Enzyme Inhibition Constant Data from BindingDB
Found 3 hits for monomerid = 50098950
TargetNitric oxide synthase, brain(Rattus norvegicus (rat))
Astrazeneca R&D Charnwood
Curated by ChEMBL
LigandPNGBDBM50098950(5-Furan-2-yl-4,5-dihydro-thieno[2,3-c]pyridin-7-yl...)
Affinity DataIC50:  40nM. Assay description: Ability to inhibit the conversion of [3H]-L-Arg to [3H]-L-citrulline catalyzed by n-NOS from rat cerebellum
In DepthDetails ArticlePubMed
TargetNitric oxide synthase, endothelial(Homo sapiens (Human))
Astrazeneca R&D Charnwood
Curated by ChEMBL
LigandPNGBDBM50098950(5-Furan-2-yl-4,5-dihydro-thieno[2,3-c]pyridin-7-yl...)
Affinity DataIC50:  920nM. Assay description: Ability to inhibit the conversion of [3H]-L-Arg to [3H]-L-citrulline catalyzed by e-NOS from HUVECcells
In DepthDetails ArticlePubMed
TargetNitric oxide synthase, inducible(Homo sapiens (Human))
Astrazeneca R&D Charnwood
Curated by ChEMBL
LigandPNGBDBM50098950(5-Furan-2-yl-4,5-dihydro-thieno[2,3-c]pyridin-7-yl...)
Affinity DataIC50:  89nM. Assay description: Ability to inhibit the conversion of [3H]-L-Arg to [3H]-L-citrulline catalyzed by i-NOS from human DLD-1 cells
In DepthDetails ArticlePubMed