BDBM50099684 CHEMBL3319577
SMILES COc1ccc(C[C@H](NC(=O)[C@@H](C)NC(=O)CN2CCOCC2)C(=O)N[C@@H](CC2CCCCC2)C(=O)[C@@]2(C)CO2)cc1
InChI Key InChIKey=UHNYITHLNFUAIN-ZMELPTPBSA-N
Data  6 IC50
  Tab Delimited (TSV)   2D SDfile   Computed 3D by Vconf -m prep SDfile
Find this compound or compounds like it in BindingDB:
Activity Spreadsheet -- Enzyme Inhibition Constant Data from BindingDB
Found 6 hits for monomerid = 50099684
TargetProteasome subunit beta type-8(Homo sapiens (Human))
Leiden Institute Of Chemistry And Netherlands Proteomics Centre
Curated by ChEMBL
LigandPNGBDBM50099684(CHEMBL3319577)
Affinity DataIC50:  36nM. Assay description: Inhibition of proteasome subunit beta-5i in human Raji cells using BODIPY-NC005 by fluorescent densitometry
In DepthDetails ArticlePubMed
TargetProteasome subunit beta type-9(Homo sapiens (Human))
Leiden Institute Of Chemistry And Netherlands Proteomics Centre
Curated by ChEMBL
LigandPNGBDBM50099684(CHEMBL3319577)
Affinity DataIC50: >1.00E+4nM. Assay description: Inhibition of proteasome subunit beta-1i in human Raji cells using BODIPY- epoxomicin by fluorescent densitometry
In DepthDetails ArticlePubMed
TargetProteasome subunit beta type-10(Homo sapiens (Human))
Leiden Institute Of Chemistry And Netherlands Proteomics Centre
Curated by ChEMBL
LigandPNGBDBM50099684(CHEMBL3319577)
Affinity DataIC50: >1.00E+4nM. Assay description: Inhibition of proteasome subunit beta-2i in human RPMI8226 cells using BODIPY-epoxomicin by fluorescent densitometry
In DepthDetails ArticlePubMed
TargetProteasome subunit beta type-8(Homo sapiens (Human))
Leiden Institute Of Chemistry And Netherlands Proteomics Centre
Curated by ChEMBL
LigandPNGBDBM50099684(CHEMBL3319577)
Affinity DataIC50:  100nM. Assay description: Inhibition of proteasome subunit beta-5i in human RPMI8226 cells using BODIPY-NC005 by fluorescent densitometry
In DepthDetails ArticlePubMed
TargetProteasome subunit beta type-9(Homo sapiens (Human))
Leiden Institute Of Chemistry And Netherlands Proteomics Centre
Curated by ChEMBL
LigandPNGBDBM50099684(CHEMBL3319577)
Affinity DataIC50:  7.30E+3nM. Assay description: Inhibition of proteasome subunit beta-1i in human RPMI8226 cells using BODIPY-NC001 by fluorescent densitometry
In DepthDetails ArticlePubMed
TargetProteasome subunit beta type-10(Homo sapiens (Human))
Leiden Institute Of Chemistry And Netherlands Proteomics Centre
Curated by ChEMBL
LigandPNGBDBM50099684(CHEMBL3319577)
Affinity DataIC50: >1.00E+4nM. Assay description: Inhibition of proteasome subunit beta-2i in human Raji cells using BODIPY- epoxomicin by fluorescent densitometry
In DepthDetails ArticlePubMed