BDBM50099897 5-Methylsulfanyl-4-(4-p-tolyl-thiazol-2-yl)-thiophene-2-carboxamidine::CHEMBL29304
SMILES CSc1sc(cc1-c1nc(cs1)-c1ccc(C)cc1)C(N)=N
InChI Key InChIKey=VLUCTQXBQVXUNP-UHFFFAOYSA-N
Data  2 KI
  Tab Delimited (TSV)   2D SDfile   Computed 3D by Vconf -m prep SDfile
Find this compound or compounds like it in BindingDB:
Activity Spreadsheet -- Enzyme Inhibition Constant Data from BindingDB
Found 2 hits for monomerid = 50099897
TargetUrokinase-type plasminogen activator(Homo sapiens (Human))
3-Dimensional Pharmaceuticals
Curated by ChEMBL
LigandPNGBDBM50099897(5-Methylsulfanyl-4-(4-p-tolyl-thiazol-2-yl)-thioph...)
Affinity DataKi:  94nM. Assay description: Inhibitory activity against serine protease urokinase-type plasminogen activator (microPa)
In DepthDetails ArticlePubMed
TargetComplement C1s subcomponent(Homo sapiens (Human))
3-Dimensional Pharmaceuticals
Curated by ChEMBL
LigandPNGBDBM50099897(5-Methylsulfanyl-4-(4-p-tolyl-thiazol-2-yl)-thioph...)
Affinity DataKi:  420nM. Assay description: In vitro binding affinity towards human Complement C1s subcomponent
In DepthDetails ArticlePubMed