BDBM50099898 4-[4-(2-Methoxy-phenyl)-thiazol-2-yl]-5-methylsulfanyl-thiophene-2-carboxamidine::CHEMBL283080
SMILES COc1ccccc1-c1csc(n1)-c1cc(sc1SC)C(N)=N
InChI Key InChIKey=VPNNTFDQKJOHAQ-UHFFFAOYSA-N
Data  2 KI
  Tab Delimited (TSV)   2D SDfile   Computed 3D by Vconf -m prep SDfile
Find this compound or compounds like it in BindingDB:
Activity Spreadsheet -- Enzyme Inhibition Constant Data from BindingDB
Found 2 hits for monomerid = 50099898
TargetUrokinase-type plasminogen activator(Homo sapiens (Human))
3-Dimensional Pharmaceuticals
Curated by ChEMBL
LigandPNGBDBM50099898(4-[4-(2-Methoxy-phenyl)-thiazol-2-yl]-5-methylsulf...)
Affinity DataKi:  130nM. Assay description: Inhibitory activity against serine protease urokinase-type plasminogen activator (microPa)
In DepthDetails ArticlePubMed
TargetComplement C1s subcomponent(Homo sapiens (Human))
3-Dimensional Pharmaceuticals
Curated by ChEMBL
LigandPNGBDBM50099898(4-[4-(2-Methoxy-phenyl)-thiazol-2-yl]-5-methylsulf...)
Affinity DataKi:  850nM. Assay description: In vitro binding affinity towards human Complement C1s subcomponent
In DepthDetails ArticlePubMed