BDBM50100149 3-{N-[N'-(5-(4-Methylpyridin-2-ylamino)pentanoyl)hydrazino]carbonyl}amino-3-(1-naphthyl) propionic acid::CHEMBL60926
SMILES OC(=O)CC(NC(=O)NNC(=O)CCCCNc1ccccn1)c1cccc2ccccc12
InChI Key InChIKey=JFQYHAIOQJMPNJ-UHFFFAOYSA-N
Data  1 IC50
  Tab Delimited (TSV)   2D SDfile   Computed 3D by Vconf -m prep SDfile
Find this compound or compounds like it in BindingDB:
Activity Spreadsheet -- Enzyme Inhibition Constant Data from BindingDB
Found 1 hit for monomerid = 50100149
TargetIntegrin alpha-V/beta-3(Homo sapiens (Human))
Technische UniversitäT MüNchen
Curated by ChEMBL
LigandPNGBDBM50100149(3-{N-[N'-(5-(4-Methylpyridin-2-ylamino)pentanoyl)h...)
Affinity DataIC50:  140nM. Assay description: Inhibitory activity against vitronectin receptor (alpha V beta 3)
In DepthDetails ArticlePubMed