BDBM50100159 3-{N-[N'-(5-(4-Methylpyridin-2-ylamino)pentanoyl)hydrazino]carbonyl}amino-3-(4-chlorophenyl) propionic acid::CHEMBL60770
SMILES OC(=O)CC(NC(=O)NNC(=O)CCCCNc1ccccn1)c1ccc(Cl)cc1
InChI Key InChIKey=BFQFATKIIYMFLO-UHFFFAOYSA-N
Data  2 IC50
  Tab Delimited (TSV)   2D SDfile   Computed 3D by Vconf -m prep SDfile
Find this compound or compounds like it in BindingDB:
Activity Spreadsheet -- Enzyme Inhibition Constant Data from BindingDB
Found 2 hits for monomerid = 50100159
TargetIntegrin alpha-IIb/beta-3(Homo sapiens (Human))
Technische UniversitäT MüNchen
Curated by ChEMBL
LigandPNGBDBM50100159(3-{N-[N'-(5-(4-Methylpyridin-2-ylamino)pentanoyl)h...)
Affinity DataIC50:  7.00E+3nM. Assay description: Inhibitory activity against alpha IIb beta 3 integrin
In DepthDetails ArticlePubMed
TargetIntegrin alpha-V/beta-3(Homo sapiens (Human))
Technische UniversitäT MüNchen
Curated by ChEMBL
LigandPNGBDBM50100159(3-{N-[N'-(5-(4-Methylpyridin-2-ylamino)pentanoyl)h...)
Affinity DataIC50:  0.300nM. Assay description: Inhibitory activity against vitronectin receptor (alpha V beta 3)
In DepthDetails ArticlePubMed