BDBM50100170 3-(4-Methoxy-phenyl)-5-{N'-[5-(4-methyl-pyridin-2-ylamino)-pentanoyl]-hydrazino}-5-oxo-pentanoic acid::CHEMBL58667
SMILES COc1ccc(cc1)C(CC(O)=O)CC(=O)NNC(=O)CCCCNc1ccccn1
InChI Key InChIKey=YNRPKKISRSDCAW-UHFFFAOYSA-N
Data  2 IC50
  Tab Delimited (TSV)   2D SDfile   Computed 3D by Vconf -m prep SDfile
Find this compound or compounds like it in BindingDB:
Activity Spreadsheet -- Enzyme Inhibition Constant Data from BindingDB
Found 2 hits for monomerid = 50100170
TargetIntegrin alpha-V/beta-3(Homo sapiens (Human))
Technische UniversitäT MüNchen
Curated by ChEMBL
LigandPNGBDBM50100170(3-(4-Methoxy-phenyl)-5-{N'-[5-(4-methyl-pyridin-2-...)
Affinity DataIC50:  22nM. Assay description: Inhibitory activity against vitronectin receptor (alpha V beta 3)
In DepthDetails ArticlePubMed
TargetIntegrin alpha-IIb/beta-3(Homo sapiens (Human))
Technische UniversitäT MüNchen
Curated by ChEMBL
LigandPNGBDBM50100170(3-(4-Methoxy-phenyl)-5-{N'-[5-(4-methyl-pyridin-2-...)
Affinity DataIC50: >1.00E+4nM. Assay description: Inhibitory activity against alpha IIb beta 3 integrin
In DepthDetails ArticlePubMed