BDBM50100179 3-{N-[N'-(5-(4-Methylpyridin-2-ylamino)pentanoyl)hydrazino]carbonyl}amino-3-(4-bromophenyl) propionic acid::CHEMBL299666
SMILES OC(=O)CC(NC(=O)NNC(=O)CCCCNc1ccccn1)c1ccc(Br)cc1
InChI Key InChIKey=SWLASRCVXLUPHK-UHFFFAOYSA-N
Data  1 IC50
  Tab Delimited (TSV)   2D SDfile   Computed 3D by Vconf -m prep SDfile
Find this compound or compounds like it in BindingDB:
Activity Spreadsheet -- Enzyme Inhibition Constant Data from BindingDB
Found 1 hit for monomerid = 50100179
TargetIntegrin alpha-V/beta-3(Homo sapiens (Human))
Technische UniversitäT MüNchen
Curated by ChEMBL
LigandPNGBDBM50100179(3-{N-[N'-(5-(4-Methylpyridin-2-ylamino)pentanoyl)h...)
Affinity DataIC50:  7nM. Assay description: Inhibitory activity against vitronectin receptor (alpha V beta 3)
In DepthDetails ArticlePubMed