BDBM50100233 6,7-Dimethoxy-3-[2-(6-methoxy-1,3,3a,4,5,9b-hexahydro-benzo[e]isoindol-2-yl)-ethyl]-1H-quinazoline-2,4-dione::CHEMBL291303
SMILES COc1cc2[nH]c(=O)n(CCN3C[C@@H]4CCc5c(OC)cccc5[C@@H]4C3)c(=O)c2cc1OC
InChI Key InChIKey=IATJRNATRBECGI-HNAYVOBHSA-N
Data  3 KI
  Tab Delimited (TSV)   2D SDfile   Computed 3D by Vconf -m prep SDfile
Find this compound or compounds like it in BindingDB:
Activity Spreadsheet -- Enzyme Inhibition Constant Data from BindingDB
Found 3 hits for monomerid = 50100233
TargetAlpha-1A adrenergic receptor(Rattus norvegicus (Rat))
Abbott Laboratories
Curated by ChEMBL
LigandPNGBDBM50100233(6,7-Dimethoxy-3-[2-(6-methoxy-1,3,3a,4,5,9b-hexahy...)
Affinity DataKi:  0.240nM. Assay description: Binding affinity to alpha-1A adrenergic receptor in rat submaxillary gland
In DepthDetails ArticlePubMed
TargetAlpha-1D adrenergic receptor(Rattus norvegicus (Rat))
Abbott Laboratories
Curated by ChEMBL
LigandPNGBDBM50100233(6,7-Dimethoxy-3-[2-(6-methoxy-1,3,3a,4,5,9b-hexahy...)
Affinity DataKi:  1.40nM. Assay description: Binding affinity of the compound to rat alpha-1D adrenergic receptor expressed in LTK cells
In DepthDetails ArticlePubMed
TargetAlpha-1B adrenergic receptor(Homo sapiens (Human))
Abbott Laboratories
Curated by ChEMBL
LigandPNGBDBM50100233(6,7-Dimethoxy-3-[2-(6-methoxy-1,3,3a,4,5,9b-hexahy...)
Affinity DataKi:  6.46nM. Assay description: Binding affinity to hamster alpha-1B adrenergic receptor
In DepthDetails ArticlePubMed