BDBM50100239 3-[2-(6-Methoxy-1,3,3a,4,5,9b-hexahydro-benzo[e]isoindol-2-yl)-ethyl]-7-nitro-1H-quinazoline-2,4-dione::CHEMBL304215
SMILES COc1cccc2[C@@H]3CN(CCn4c(=O)[nH]c5cc(ccc5c4=O)[N+]([O-])=O)C[C@@H]3CCc12
InChI Key InChIKey=DQSYTGKEJVGVLB-IFXJQAMLSA-N
Data  3 KI
  Tab Delimited (TSV)   2D SDfile   Computed 3D by Vconf -m prep SDfile
Find this compound or compounds like it in BindingDB:
Activity Spreadsheet -- Enzyme Inhibition Constant Data from BindingDB
Found 3 hits for monomerid = 50100239
TargetAlpha-1A adrenergic receptor(Rattus norvegicus (Rat))
Abbott Laboratories
Curated by ChEMBL
LigandPNGBDBM50100239(3-[2-(6-Methoxy-1,3,3a,4,5,9b-hexahydro-benzo[e]is...)
Affinity DataKi:  0.910nM. Assay description: Binding affinity to alpha-1A adrenergic receptor in rat submaxillary gland
In DepthDetails ArticlePubMed
TargetAlpha-1D adrenergic receptor(Rattus norvegicus (Rat))
Abbott Laboratories
Curated by ChEMBL
LigandPNGBDBM50100239(3-[2-(6-Methoxy-1,3,3a,4,5,9b-hexahydro-benzo[e]is...)
Affinity DataKi:  1.20nM. Assay description: Binding affinity of the compound to rat alpha-1D adrenergic receptor expressed in LTK cells
In DepthDetails ArticlePubMed
TargetAlpha-1B adrenergic receptor(Homo sapiens (Human))
Abbott Laboratories
Curated by ChEMBL
LigandPNGBDBM50100239(3-[2-(6-Methoxy-1,3,3a,4,5,9b-hexahydro-benzo[e]is...)
Affinity DataKi:  3.33nM. Assay description: Binding affinity to hamster alpha-1B adrenergic receptor
In DepthDetails ArticlePubMed