BDBM50100580 5-(3-Bromo-phenyl)-7-(6-dimethylamino-pyridin-3-yl)-pyrido[2,3-d]pyrimidin-4-ylamine::CHEMBL68748
SMILES CN(C)c1ccc(cn1)-c1cc(-c2cccc(Br)c2)c2c(N)ncnc2n1
InChI Key InChIKey=ZKMZZIXDNQFKGJ-UHFFFAOYSA-N
Data  2 IC50
  Tab Delimited (TSV)   2D SDfile   Computed 3D by Vconf -m prep SDfile
Find this compound or compounds like it in BindingDB:
Activity Spreadsheet -- Enzyme Inhibition Constant Data from BindingDB
Found 2 hits for monomerid = 50100580
TargetAdenosine kinase(Rattus norvegicus (rat))
Abbott Laboratories
Curated by ChEMBL
LigandPNGBDBM50100580(5-(3-Bromo-phenyl)-7-(6-dimethylamino-pyridin-3-yl...)
Affinity DataIC50:  1.80nM. Assay description: In vitro inhibition of Adenosine kinase (AK)
In DepthDetails ArticlePubMed
TargetAdenosine kinase(Homo sapiens (Human))
Abbott Laboratories
Curated by ChEMBL
LigandPNGBDBM50100580(5-(3-Bromo-phenyl)-7-(6-dimethylamino-pyridin-3-yl...)
Affinity DataIC50:  32nM. Assay description: Inhibition of adenosine phosphorylation in confluent IMR-32 (human neuroblastoma) cells.
In DepthDetails ArticlePubMed