BDBM50101015 1-{4-[4-amino(imino)methylphenylcarboxamidomethyl]hexahydro-1-pyridinylcarbonyloxy}-5-[4-(2-hexahydro-4-pyridinylethylcarbamoyl)hexahydro-1-pyrazinylcarbonyloxy]cyclooctane::CHEMBL42899
SMILES NC(=N)c1ccc(cc1)C(=O)NCC1CCN(CC1)C(=O)O[C@H]1CCC[C@H](CCC1)OC(=O)N1CCN(CC1)C(=O)NCCC1CCNCC1
InChI Key InChIKey=BCYMMXPTRFITIK-QRRGNZNSSA-N
Data  4 KI
  Tab Delimited (TSV)   2D SDfile   Computed 3D by Vconf -m prep SDfile
Find this compound or compounds like it in BindingDB:
Activity Spreadsheet -- Enzyme Inhibition Constant Data from BindingDB
Found 4 hits for monomerid = 50101015
TargetTryptase beta-2/delta/gamma(Homo sapiens (Human))
Axys Pharmaceuticals
Curated by ChEMBL
LigandPNGBDBM50101015(1-{4-[4-amino(imino)methylphenylcarboxamidomethyl]...)
Affinity DataKi:  16nM. Assay description: Binding affinity to 5-HT3 serotonin receptor in NG 108-15 neuroblastoma glioma cells using [3H]-GR-65,630 radioligand.
In DepthDetails ArticlePubMed
TargetTrypsin(Homo sapiens (Human))
Axys Pharmaceuticals
Curated by ChEMBL
LigandPNGBDBM50101015(1-{4-[4-amino(imino)methylphenylcarboxamidomethyl]...)
Affinity DataKi:  3.88E+4nM. Assay description: Binding affinity to 5-HT3 serotonin receptor in NG 108-15 neuroblastoma glioma cells using [3H]-GR-65,630 radioligand.
In DepthDetails ArticlePubMed
TargetProthrombin(Homo sapiens (Human))
Axys Pharmaceuticals
Curated by ChEMBL
LigandPNGBDBM50101015(1-{4-[4-amino(imino)methylphenylcarboxamidomethyl]...)
Affinity DataKi:  4.12E+4nM. Assay description: Inhibition of thrombin in human mast cells
In DepthDetails ArticlePubMed
TargetPlasminogen(Homo sapiens (Human))
Axys Pharmaceuticals
Curated by ChEMBL
LigandPNGBDBM50101015(1-{4-[4-amino(imino)methylphenylcarboxamidomethyl]...)
Affinity DataKi:  2.79E+5nM. Assay description: Inhibition plasmin in human mast cells
In DepthDetails ArticlePubMed