BDBM50101056 2-Biphenyl-2-yl-N-[(2R,3S,5R)-5-(5-ethyl-2,4-dioxo-3,4-dihydro-2H-pyrimidin-1-yl)-3-hydroxy-tetrahydro-furan-2-ylmethyl]-acetamide::CHEMBL46739
SMILES CCc1cn([C@H]2C[C@H](O)[C@@H](CNC(=O)Cc3ccccc3-c3ccccc3)O2)c(=O)[nH]c1=O
InChI Key InChIKey=LRHPEUHNBULMRW-QZNHQXDQSA-N
Data  2 IC50
  Tab Delimited (TSV)   2D SDfile   Computed 3D by Vconf -m prep SDfile
Find this compound or compounds like it in BindingDB:
Activity Spreadsheet -- Enzyme Inhibition Constant Data from BindingDB
Found 2 hits for monomerid = 50101056
TargetThymidine kinase(Human herpesvirus 1 (strain SC16) (HHV-1) (Human h...)
Roche Discovery Welwyn
Curated by ChEMBL
LigandPNGBDBM50101056(2-Biphenyl-2-yl-N-[(2R,3S,5R)-5-(5-ethyl-2,4-dioxo...)
Affinity DataIC50:  240nM. Assay description: Inhibitory activity against HSV-1 Thymidine Kinase (HSV-1 TK)
In DepthDetails ArticlePubMed
TargetThymidine kinase(Human herpesvirus 2)
Roche Discovery Welwyn
Curated by ChEMBL
LigandPNGBDBM50101056(2-Biphenyl-2-yl-N-[(2R,3S,5R)-5-(5-ethyl-2,4-dioxo...)
Affinity DataIC50:  90nM. Assay description: Inhibitory activity against HSV-2 Thymidine Kinase (HSV-2 TK)
In DepthDetails ArticlePubMed