BDBM50101661 4-{2-[4-(2-Methoxy-phenyl)-piperazin-1-yl]-ethylamino}-2-methyl-6-phenyl-2H-pyridazin-3-one::CHEMBL311479
SMILES COc1ccccc1N1CCN(CCNc2cc(nn(C)c2=O)-c2ccccc2)CC1
InChI Key InChIKey=CYGUSDVXGIEDMH-UHFFFAOYSA-N
Data  4 KI
  Tab Delimited (TSV)   2D SDfile   Computed 3D by Vconf -m prep SDfile
Find this compound or compounds like it in BindingDB:
Activity Spreadsheet -- Enzyme Inhibition Constant Data from BindingDB
Found 4 hits for monomerid = 50101661
TargetAlpha-1A adrenergic receptor(Homo sapiens (Human))
Istituto Chimico Farmaceutico E Tossicologico
Curated by ChEMBL
LigandPNGBDBM50101661(4-{2-[4-(2-Methoxy-phenyl)-piperazin-1-yl]-ethylam...)
Affinity DataKi:  0.220nM. Assay description: Binding affinity towards human cloned alpha1A-adrenoceptor using [3H]-prazosin as radioligand
In DepthDetails ArticlePubMed
TargetAlpha-1B adrenergic receptor(Homo sapiens (Human))
Istituto Chimico Farmaceutico E Tossicologico
Curated by ChEMBL
LigandPNGBDBM50101661(4-{2-[4-(2-Methoxy-phenyl)-piperazin-1-yl]-ethylam...)
Affinity DataKi:  2.01nM. Assay description: Binding affinity towards human cloned alpha1B-adrenoceptor using [3H]-prazosin as radioligand
In DepthDetails ArticlePubMed
TargetAlpha-1D adrenergic receptor(Homo sapiens (Human))
Istituto Chimico Farmaceutico E Tossicologico
Curated by ChEMBL
LigandPNGBDBM50101661(4-{2-[4-(2-Methoxy-phenyl)-piperazin-1-yl]-ethylam...)
Affinity DataKi:  11.8nM. Assay description: Binding affinity towards human cloned alpha1d-adrenoceptor using [3H]-prazosin as radioligand
In DepthDetails ArticlePubMed
Target5-hydroxytryptamine receptor 1A(Homo sapiens (Human))
Istituto Chimico Farmaceutico E Tossicologico
Curated by ChEMBL
LigandPNGBDBM50101661(4-{2-[4-(2-Methoxy-phenyl)-piperazin-1-yl]-ethylam...)
Affinity DataKi:  14.0nM. Assay description: Binding affinity towards human cloned 5-hydroxytryptamine 1A receptor using [3H]-8-OH-DPAT as radioligand
In DepthDetails ArticlePubMed