BDBM50101790 CHEMBL60334::N-(4-Phenyl-thiazol-2-yl)-benzamide
SMILES O=C(Nc1nc(cs1)-c1ccccc1)c1ccccc1
InChI Key InChIKey=NIRMZOKDACPPER-UHFFFAOYSA-N
Data  1 KI
  Tab Delimited (TSV)   2D SDfile   Computed 3D by Vconf -m prep SDfile
Find this compound or compounds like it in BindingDB:
Activity Spreadsheet -- Enzyme Inhibition Constant Data from BindingDB
Found 1 hit for monomerid = 50101790
TargetAdenosine receptor A1(Rattus norvegicus (rat))
Leiden/Amsterdam Center For Drug Research
Curated by ChEMBL
LigandPNGBDBM50101790(CHEMBL60334 | N-(4-Phenyl-thiazol-2-yl)-benzamide)
Affinity DataKi:  39nM. Assay description: Displacement of [3H]-DPCPX from Adenosine A1 receptor of rat cortical membrane
In DepthDetails ArticlePubMed