BDBM50102207 5-Dimethylamino-naphthalene-1-sulfonic acid [4-(N'-methyl-guanidino)-1-(piperidine-1-carbonyl)-butyl]-amide; hydrochloride::CHEMBL544274
SMILES CNC(=N)NCCCC(NS(=O)(=O)c1cccc2c(cccc12)N(C)C)C(=O)N1CCCCC1
InChI Key InChIKey=NISSHAOYURYJAF-UHFFFAOYSA-N
Data  2 KI
  Tab Delimited (TSV)   2D SDfile   Computed 3D by Vconf -m prep SDfile
Find this compound or compounds like it in BindingDB:
Activity Spreadsheet -- Enzyme Inhibition Constant Data from BindingDB
Found 2 hits for monomerid = 50102207
TargetProthrombin(Homo sapiens (Human))
Medical University Of South Carolina
Curated by ChEMBL
LigandPNGBDBM50102207(5-Dimethylamino-naphthalene-1-sulfonic acid [4-(N'...)
Affinity DataKi:  958nM. Assay description: Binding affinity determined against thrombin by Dixon method
In DepthDetails ArticlePubMed
TargetSerine protease 1(Bos taurus (bovine))
Medical University Of South Carolina
Curated by ChEMBL
LigandPNGBDBM50102207(5-Dimethylamino-naphthalene-1-sulfonic acid [4-(N'...)
Affinity DataKi:  9.22E+5nM. Assay description: Binding affinity determined against trypsin by Dixon method
In DepthDetails ArticlePubMed