BDBM50102210 5-Dimethylamino-naphthalene-1-sulfonic acid [4-guanidino-1-(piperidine-1-carbonyl)-butyl]-amide; hydrochloride::CHEMBL170488::CHEMBL545680
SMILES CN(C)c1cccc2c(cccc12)S(=O)(=O)NC(CCCNC(N)=N)C(=O)N1CCCCC1
InChI Key InChIKey=WMTAGTJIKZZYPR-UHFFFAOYSA-N
Data  2 KI  1 IC50
  Tab Delimited (TSV)   2D SDfile   Computed 3D by Vconf -m prep SDfile
Find this compound or compounds like it in BindingDB:
Activity Spreadsheet -- Enzyme Inhibition Constant Data from BindingDB
Found 3 hits for monomerid = 50102210
TargetProthrombin(Homo sapiens (Human))
Medical University Of South Carolina
Curated by ChEMBL
LigandPNGBDBM50102210(5-Dimethylamino-naphthalene-1-sulfonic acid [4-gua...)
Affinity DataKi:  83nM. Assay description: Binding affinity determined against thrombin by Dixon method
In DepthDetails ArticlePubMed
TargetSerine protease 1(Bos taurus (bovine))
Medical University Of South Carolina
Curated by ChEMBL
LigandPNGBDBM50102210(5-Dimethylamino-naphthalene-1-sulfonic acid [4-gua...)
Affinity DataKi:  2.34E+3nM. Assay description: Binding affinity determined against trypsin by Dixon method
In DepthDetails ArticlePubMed
TargetProthrombin(Bos taurus (Bovine))
TBA
Curated by ChEMBL
LigandPNGBDBM50102210(5-Dimethylamino-naphthalene-1-sulfonic acid [4-gua...)
Affinity DataIC50:  1.00E+9nM. Assay description: Bovine thrombin concentration at which clotting time was prolonged 2x over the control.
In DepthDetails ArticlePubMed