BDBM50102342 2-(4-(3-(2,5-dimethylthiophen-3-yl)-3-hydroxypropyl)piperazin-1-yl)phenol::2-{4-[3-(2,5-Dimethyl-thiophen-3-yl)-3-hydroxy-propyl]-piperazin-1-yl}-phenol::CHEMBL133207
SMILES Cc1cc(C(O)CCN2CCN(CC2)c2ccccc2O)c(C)s1
InChI Key InChIKey=ILEHGFRGCDSQNV-UHFFFAOYSA-N
Data  4 KI
  Tab Delimited (TSV)   2D SDfile   Computed 3D by Vconf -m prep SDfile
Find this compound or compounds like it in BindingDB:
Activity Spreadsheet -- Enzyme Inhibition Constant Data from BindingDB
Found 4 hits for monomerid = 50102342
Target5-hydroxytryptamine receptor 1A(Homo sapiens (Human))
Universidade Federal Da Para£Ba
Curated by ChEMBL
LigandPNGBDBM50102342(2-(4-(3-(2,5-dimethylthiophen-3-yl)-3-hydroxypropy...)
Affinity DataKi:  89.1nM. Assay description: Antagonist activity at 5HT1A
In DepthDetails ArticlePubMed
Target5-hydroxytryptamine receptor 1A(Rattus norvegicus (rat))
Universidad De Navarra
Curated by ChEMBL
LigandPNGBDBM50102342(2-(4-(3-(2,5-dimethylthiophen-3-yl)-3-hydroxypropy...)
Affinity DataKi:  90nM. Assay description: Binding affinity to 5-hydroxytryptamine 1A receptor (5-HT 1A receptor, serotonin receptor) from rat cortex using [3H]-8-OH-DPAT as radioligand
In DepthDetails ArticlePubMed
Target5-hydroxytryptamine receptor 1A(Homo sapiens (Human))
Universidade Federal Da Para£Ba
Curated by ChEMBL
LigandPNGBDBM50102342(2-(4-(3-(2,5-dimethylthiophen-3-yl)-3-hydroxypropy...)
Affinity DataKi:  91.2nM. Assay description: Binding affinity to 5HT1A receptor
In DepthDetails ArticlePubMed
TargetSodium-dependent serotonin transporter(Rattus norvegicus (rat))
Universidad De Navarra
Curated by ChEMBL
LigandPNGBDBM50102342(2-(4-(3-(2,5-dimethylthiophen-3-yl)-3-hydroxypropy...)
Affinity DataKi:  2.50E+3nM. Assay description: Binding affinity towards Serotonin transporter from rat cortex measured using [3H]-paroxetine
In DepthDetails ArticlePubMed