BDBM50102348 3-[4-(4-Chloro-phenyl)-piperazin-1-yl]-1-thiophen-2-yl-propan-1-one::CHEMBL134598
SMILES Clc1ccc(cc1)N1CCN(CCC(=O)c2cccs2)CC1
InChI Key InChIKey=VUMYYEKTFQKNCI-UHFFFAOYSA-N
Data  3 KI
  Tab Delimited (TSV)   2D SDfile   Computed 3D by Vconf -m prep SDfile
Find this compound or compounds like it in BindingDB:
Activity Spreadsheet -- Enzyme Inhibition Constant Data from BindingDB
Found 3 hits for monomerid = 50102348
TargetSodium-dependent serotonin transporter(Rattus norvegicus (rat))
Universidad De Navarra
Curated by ChEMBL
LigandPNGBDBM50102348(3-[4-(4-Chloro-phenyl)-piperazin-1-yl]-1-thiophen-...)
Affinity DataKi:  60nM. Assay description: Binding affinity towards Serotonin transporter from rat cortex measured using [3H]-paroxetine
In DepthDetails ArticlePubMed
Target5-hydroxytryptamine receptor 1A(Rattus norvegicus (rat))
Universidad De Navarra
Curated by ChEMBL
LigandPNGBDBM50102348(3-[4-(4-Chloro-phenyl)-piperazin-1-yl]-1-thiophen-...)
Affinity DataKi: >5.00E+3nM. Assay description: Binding affinity to 5-hydroxytryptamine 1A receptor (5-HT 1A receptor, serotonin receptor) from rat cortex using [3H]-8-OH-DPAT as radioligand
In DepthDetails ArticlePubMed
Target5-hydroxytryptamine receptor 1A(Homo sapiens (Human))
Universidade De S£O Paulo
Curated by ChEMBL
LigandPNGBDBM50102348(3-[4-(4-Chloro-phenyl)-piperazin-1-yl]-1-thiophen-...)
Affinity DataKi:  5.01E+3nM. Assay description: Binding affinity to 5HT1A receptor
In DepthDetails ArticlePubMed