BDBM50102355 3-(4-(2-methoxyphenyl)piperazin-1-yl)-1-(thiophen-2-yl)propan-1-ol::3-[4-(2-Methoxy-phenyl)-piperazin-1-yl]-1-thiophen-2-yl-propan-1-ol::CHEMBL135939
SMILES COc1ccccc1N1CCN(CCC(O)c2cccs2)CC1
InChI Key InChIKey=YCYJELCQDPWXRJ-UHFFFAOYSA-N
Data  4 KI
  Tab Delimited (TSV)   2D SDfile   Computed 3D by Vconf -m prep SDfile
Find this compound or compounds like it in BindingDB:
Activity Spreadsheet -- Enzyme Inhibition Constant Data from BindingDB
Found 4 hits for monomerid = 50102355
Target5-hydroxytryptamine receptor 1A(Rattus norvegicus (rat))
Universidad De Navarra
Curated by ChEMBL
LigandPNGBDBM50102355(3-(4-(2-methoxyphenyl)piperazin-1-yl)-1-(thiophen-...)
Affinity DataKi:  19nM. Assay description: Binding affinity to 5-hydroxytryptamine 1A receptor (5-HT 1A receptor, serotonin receptor) from rat cortex using [3H]-8-OH-DPAT as radioligand
In DepthDetails ArticlePubMed
Target5-hydroxytryptamine receptor 1A(Homo sapiens (Human))
Universidade Federal Da Para£Ba
Curated by ChEMBL
LigandPNGBDBM50102355(3-(4-(2-methoxyphenyl)piperazin-1-yl)-1-(thiophen-...)
Affinity DataKi:  19.1nM. Assay description: Antagonist activity at 5HT1A
In DepthDetails ArticlePubMed
Target5-hydroxytryptamine receptor 1A(Homo sapiens (Human))
Universidade Federal Da Para£Ba
Curated by ChEMBL
LigandPNGBDBM50102355(3-(4-(2-methoxyphenyl)piperazin-1-yl)-1-(thiophen-...)
Affinity DataKi:  19.1nM. Assay description: Binding affinity to 5HT1A receptor
In DepthDetails ArticlePubMed
TargetSodium-dependent serotonin transporter(Rattus norvegicus (rat))
Universidad De Navarra
Curated by ChEMBL
LigandPNGBDBM50102355(3-(4-(2-methoxyphenyl)piperazin-1-yl)-1-(thiophen-...)
Affinity DataKi:  1.25E+3nM. Assay description: Binding affinity towards Serotonin transporter from rat cortex measured using [3H]-paroxetine
In DepthDetails ArticlePubMed