BDBM50102357 1-Benzo[b]thiophen-3-yl-3-[4-(4-chloro-2-methoxy-phenyl)-piperazin-1-yl]-propan-1-ol::CHEMBL135451
SMILES COc1cc(Cl)ccc1N1CCN(CCC(O)c2csc3ccccc23)CC1
InChI Key InChIKey=RTHNQOOZIMUOPA-UHFFFAOYSA-N
Data  3 KI
  Tab Delimited (TSV)   2D SDfile   Computed 3D by Vconf -m prep SDfile
Find this compound or compounds like it in BindingDB:
Activity Spreadsheet -- Enzyme Inhibition Constant Data from BindingDB
Found 3 hits for monomerid = 50102357
TargetSodium-dependent serotonin transporter(Rattus norvegicus (rat))
Universidad De Navarra
Curated by ChEMBL
LigandPNGBDBM50102357(1-Benzo[b]thiophen-3-yl-3-[4-(4-chloro-2-methoxy-p...)
Affinity DataKi:  35nM. Assay description: Binding affinity towards Serotonin transporter from rat cortex measured using [3H]-paroxetine
In DepthDetails ArticlePubMed
Target5-hydroxytryptamine receptor 1A(Rattus norvegicus (rat))
Universidad De Navarra
Curated by ChEMBL
LigandPNGBDBM50102357(1-Benzo[b]thiophen-3-yl-3-[4-(4-chloro-2-methoxy-p...)
Affinity DataKi:  361nM. Assay description: Binding affinity to 5-hydroxytryptamine 1A receptor (5-HT 1A receptor, serotonin receptor) from rat cortex using [3H]-8-OH-DPAT as radioligand
In DepthDetails ArticlePubMed
Target5-hydroxytryptamine receptor 1A(Homo sapiens (Human))
Universidade De S£O Paulo
Curated by ChEMBL
LigandPNGBDBM50102357(1-Benzo[b]thiophen-3-yl-3-[4-(4-chloro-2-methoxy-p...)
Affinity DataKi:  363nM. Assay description: Binding affinity to 5HT1A receptor
In DepthDetails ArticlePubMed