BDBM50103120 CHEMBL69497::N,N-Dibenzyl-N'-[1-pyridin-2-yl-meth-(E)-ylidene]-hydrazine
SMILES C(N(Cc1ccccc1)\N=C\c1ccccn1)c1ccccc1
InChI Key InChIKey=IPXKRUCFNUYSKI-PXLXIMEGSA-N
Data  1 IC50
  Tab Delimited (TSV)   2D SDfile   Computed 3D by Vconf -m prep SDfile
Find this compound or compounds like it in BindingDB:
Activity Spreadsheet -- Enzyme Inhibition Constant Data from BindingDB
Found 1 hit for monomerid = 50103120
TargetGlucose-6-phosphatase catalytic subunit 1(Homo sapiens (Human))
Novo Nordisk
Curated by ChEMBL
LigandPNGBDBM50103120(CHEMBL69497 | N,N-Dibenzyl-N'-[1-pyridin-2-yl-meth...)
Affinity DataIC50:  1.00E+4nM. Assay description: Compound was evaluated for inhibition of Glucose-6-Phosphatase from Triton X-100 disrupted pig liver microsomes.
In DepthDetails ArticlePubMed